{"text_format":"2","workbook":"xlsx","n_sheets":2,"sheets":["Information","Samleark"],"not_rendered":{"charts":0,"images":1,"macros":0,"external_links":0,"defined_names":0,"comments":1,"pivot_tables":0},"unopened":[],"bounds":{"document_bytes":16777216,"sheet_cells":100000,"run_cost":"one","rows_first":2000,"rows_last":500,"rows_between":2000,"halvings":0,"cell_chars":16384,"cell_head_chars":4096},"cells_cut":0,"cells_raw":0,"read":"whole","date_system":"1900"}

{"sheet":"Information","index":0,"n_rows":33,"n_cols":7,"rows_kept":33,"cut":false,"hidden":false,"merged":[[13,0,13,6],[5,0,5,6],[0,5,0,6]]}
["Hvidovre Idrætsforening, Fodboldafdelingen",{"$nulls":4},"Godtgørelse 2020\n(Under 5.850 pr. år)"]
[]
["Information 2020"]
[]
[]
["Ulønnede instruktører, trænere og ledere kan få skattefri omkostningsgodtgørelse for det arbejde, de udfører i deres forening. Skatterådet har justeret enkelte satser, for eksempel kørsel. De nye satser gælder pr. 1. 1. 2020."]
[]
[null,null,null,"Godtgørelse pr. år.",null,"Godtgørelse pr. mdr."]
["Telefonsamtaler og internetforbrug",null,null,2400,null,{"$f":"D9/12","v":200}]
["Administrative omkostninger",null,null,1450,null,{"$f":"D10/12","v":120.83333333333333}]
["Køb, vask og vedligeholdelse af tøj",null,null,2000,null,166.66666666666666]
["I alt ",null,null,{"$f":"SUM(D6:D11)","v":5850},"pr. år",487.5,"pr. mdr."]
[]
["Din forening kan udbetale befordringsgodtgørelse til personer, der udfører frivilligt arbejde i foreningen. Skatterådet har fastsat nye satser, som gælder pr. 1. 1. 2020:"]
[]
[null,"Km","Sats","Godtgørelse i alt"]
["De første 20.000 km.: ",20000,3.52,{"$f":"B17*C17","v":70400},"(2019: 3,56 kr.)"]
["Over 20.000 km.: ",null,1.96,null,"(2019: 1,98 kr.)"]
[]
["Kost ved arrangementer: ",null,80,"pr. dag. Arrangementet skal vare minimum 5 timer."]
[]
["Læs mere om godtgørelse på HIF hjemmeside",{"$nulls":4},"Her"]
[]
["Afdelinger","Afdelingsleder",null,null,"Hvem er omfattet "]
["Vælg Afdeling","-",null,null,"-"]
["Sportslig Ansvarlig","Jacob Kornerup",null,null,"Afdelingsledere"]
["Talentakademiet (U13A-19A + U23)","Christian Grønbæk",null,null,"(U13A-19A + 2. senior)"]
["Børneakademiet (U3-U12 Drenge & Piger)","Jack Nilaus",null,null,"(U3-U12)"]
["Ungdom/-senior (Herre & Damer U13-U19 + Senior og GM)","Lotte Christiansen",null,null,"(U13-U19 + Senior og GM)"]
[]
["Godkendelse"]
["Godtgørelsen skal være godkendt af din afdelingsleder",null,"JA"]
[null,null,"NEJ"]

{"sheet":"Samleark","index":1,"n_rows":37,"n_cols":6,"rows_kept":37,"cut":false,"hidden":false,"merged":[[0,5,0,6],[13,2,13,4],[14,2,14,4],[15,2,15,4],[5,2,5,4],[6,2,6,4],[7,2,7,4],[8,2,8,4],[10,2,10,4],[11,2,11,4]]}
["Hvidovre Idrætsforening, Fodboldafdelingen",{"$nulls":4},{"$f":"Information!F1","v":"Godtgørelse 2020\n(Under 5.850 pr. år)"}]
[]
["Information"]
[]
[]
["Navn"]
["Adresse"]
["Cpr. nr."]
["Køretøjets reg.nr."]
[]
["Afdeling",null,"Vælg Afdeling"]
["Afdelingsleder",null,{"$f":"VLOOKUP(C11,Information!A25:'Information'!C29,2,FALSE)","v":"-"}]
[]
["Afregningsperiode",null,"Måned"]
["Mdr. aftalt godtgørelse",null,"Hvilken mdr. godtgørelse er aftalt"]
["Reg. Nr. & Kontonummer til overførsel",null,"Reg. & Kontonummer"]
[]
[]
["Standard jf. aftale"]
["Antal mdr. godtgørelsen dækker",null,null,6,"måneder"]
[]
[null,null,null,"Godtgøresle"]
["Telefonsamtaler og internetforbrug",null,null,{"$f":"Information!F9*D20","v":1200}]
["Administrative omkostninger",null,null,{"$f":"Information!F10*D20","v":725}]
["Køb, vask og vedligeholdelse af tøj",null,null,{"$f":"Information!F11*D20","v":1000}]
["I alt ",null,null,{"$f":"SUM(D20:D25)","v":2931}]
[]
["Godtgørelse i alt",null,null,{"$f":"D26","v":2931}]
[]
["Beløb der maksimalt godtgøres af klubben jf. aftale"]
[]
[]
[]
["Udarbejdet af:"]
[null,"Dato",null,null,"Navn (Underskrift hvis ikke elektronisk)"]
["Godkendt af:"]
[null,"Dato",null,null,"Navn (Underskrift hvis ikke elektronisk)"]